Target
Phosphoethanolamine/phosphocholine phosphatase
Ligand
BDBM46058
Substrate
Meas. Tech.
ChEMBL_1448918 (CHEMBL3375685)
IC50
1100±n/a nM
Citation
 Bravo, YTeriete, PDhanya, RPDahl, RLee, PSKiffer-Moreira, TGanji, SRSergienko, ESmith, LHFarquharson, CMillán, JLCosford, ND Design, synthesis and evaluation of benzoisothiazolones as selective inhibitors of PHOSPHO1. Bioorg Med Chem Lett 24:4308-11 (2014)  
Target
Name:
Phosphoethanolamine/phosphocholine phosphatase
Synonyms:
PHOP1_HUMAN phosphatase, orphan 1
Type:
Enzyme Catalytic Domain
Mol. Mass.:
29718.09
Organism:
Homo sapiens (Human)
Description:
Q8TCT1
Residue:
267
  
Inhibitor
Name:
BDBM46058
Synonyms:
3-(3-keto-1,2-benzothiazol-2-yl)benzoic acid 3-(3-oxo-1,2-benzothiazol-2-yl)benzoic acid cid_25181200
Type:
Small organic molecule
Emp. Form.:
C14H9NO3S
Mol. Mass.:
271.291
SMILES:
OC(=O)c1cccc(c1)-n1sc2ccccc2c1=O
: