Target
Phosphoethanolamine/phosphocholine phosphatase
Ligand
BDBM46655
Substrate
Meas. Tech.
ChEMBL_1448918 (CHEMBL3375685)
IC50
1800±n/a nM
Citation
 Bravo, YTeriete, PDhanya, RPDahl, RLee, PSKiffer-Moreira, TGanji, SRSergienko, ESmith, LHFarquharson, CMillán, JLCosford, ND Design, synthesis and evaluation of benzoisothiazolones as selective inhibitors of PHOSPHO1. Bioorg Med Chem Lett 24:4308-11 (2014)  
Target
Name:
Phosphoethanolamine/phosphocholine phosphatase
Synonyms:
PHOP1_HUMAN phosphatase, orphan 1
Type:
Enzyme Catalytic Domain
Mol. Mass.:
29718.09
Organism:
Homo sapiens (Human)
Description:
Q8TCT1
Residue:
267
  
Inhibitor
Name:
BDBM46655
Synonyms:
2-(3-chloranyl-4-fluoranyl-phenyl)-1,2-benzothiazol-3-one 2-(3-chloro-4-fluorophenyl)-1,2-benzothiazol-3-one cid_4989572
Type:
Small organic molecule
Emp. Form.:
C13H7ClFNOS
Mol. Mass.:
279.717
SMILES:
Fc1ccc(cc1Cl)-n1sc2ccccc2c1=O
: