Target
Phosphoethanolamine/phosphocholine phosphatase
Ligand
BDBM46035
Substrate
Meas. Tech.
ChEMBL_1448918 (CHEMBL3375685)
IC50
1100±n/a nM
Citation
 Bravo, YTeriete, PDhanya, RPDahl, RLee, PSKiffer-Moreira, TGanji, SRSergienko, ESmith, LHFarquharson, CMillán, JLCosford, ND Design, synthesis and evaluation of benzoisothiazolones as selective inhibitors of PHOSPHO1. Bioorg Med Chem Lett 24:4308-11 (2014)  
Target
Name:
Phosphoethanolamine/phosphocholine phosphatase
Synonyms:
PHOP1_HUMAN phosphatase, orphan 1
Type:
Enzyme Catalytic Domain
Mol. Mass.:
29718.09
Organism:
Homo sapiens (Human)
Description:
Q8TCT1
Residue:
267
  
Inhibitor
Name:
BDBM46035
Synonyms:
2-(4-chloranyl-3-morpholin-4-ylsulfonyl-phenyl)-1,2-benzothiazol-3-one 2-(4-chloro-3-morpholinosulfonyl-phenyl)-1,2-benzothiazol-3-one MLS-0315794.0001 | cid_2325813
Type:
Small organic molecule
Emp. Form.:
C17H15ClN2O4S2
Mol. Mass.:
410.895
SMILES:
Clc1ccc(cc1S(=O)(=O)N1CCOCC1)-n1sc2ccccc2c1=O
: