Target
D(3) dopamine receptor
Ligand
BDBM50057777
Substrate
Meas. Tech.
ChEMBL_1449821 (CHEMBL3379350)
Ki
8.4±n/a nM
Citation
 Ananthan, SSaini, SKZhou, GHobrath, JVPadmalayam, IZhai, LBostwick, JRAntonio, TReith, MEMcDowell, SCho, EMcAleer, LTaylor, MLuedtke, RR Design, synthesis, and structure-activity relationship studies of a series of [4-(4-carboxamidobutyl)]-1-arylpiperazines: insights into structural features contributing to dopamine D3 versus D2 receptor subtype selectivity. J Med Chem 57:7042-60 (2014)  
Target
Name:
D(3) dopamine receptor
Synonyms:
DOPAMINE D3 DRD3_HUMAN Dopamine D3 receptor (D3) Dopamine receptor Dopamine receptor D3
Type:
Mol. Mass.:
44243.43
Organism:
Homo sapiens (Human)
Description:
Residue:
400
  
Inhibitor
Name:
BDBM50057777
Synonyms:
CHEMBL3323010 US9969743, 112
Type:
Small organic molecule
Emp. Form.:
C27H37N7O
Mol. Mass.:
475.629
SMILES:
CC(C)(C)c1nc(cc(n1)N1CCN(CCCCNC(=O)c2cn3ccccc3n2)CC1)C1CC1
: