Target
DNA topoisomerase 4 subunit B
Ligand
BDBM50058510
Substrate
Meas. Tech.
ChEMBL_1448969 (CHEMBL3376316)
IC50
800±n/a nM
Citation
 Yule, IACzaplewski, LGPommier, SDavies, DTNarramore, SKFishwick, CW Pyridine-3-carboxamide-6-yl-ureas as novel inhibitors of bacterial DNA gyrase: structure based design, synthesis, SAR and antimicrobial activity. Eur J Med Chem 86:31-8 (2014)  
Target
Name:
DNA topoisomerase 4 subunit B
Synonyms:
DNA topoisomerase 4 subunit B PARE_STAA8 grlB | parE
Type:
Enzyme
Mol. Mass.:
74365.92
Organism:
Staphylococcus aureus
Description:
Q2FYS5
Residue:
663
  
Inhibitor
Name:
BDBM50058510
Synonyms:
CHEMBL3329319
Type:
Small organic molecule
Emp. Form.:
C22H24N6O4
Mol. Mass.:
436.4638
SMILES:
CCNC(=O)Nc1cc(Nc2ccc(OC)cc2OC)c(cn1)C(=O)Nc1cccnc1
: