Target
Carbonic anhydrase 2
Ligand
BDBM50058822
Substrate
Meas. Tech.
ChEMBL_1452411 (CHEMBL3362073)
Ki
308±n/a nM
Citation
 Schwarz, SSommerwerk, SLucas, SDHeller, LCsuk, R Sulfamates of methyl triterpenoates are effective and competitive inhibitors of carbonic anhydrase II. Eur J Med Chem 86:95-102 (2014)  
Target
Name:
Carbonic anhydrase 2
Synonyms:
CA2 Carbonic anhydrase Carbonic anhydrase II Carbonic anhydrase II (CA-II)
Type:
Enzyme Catalytic Domain
Mol. Mass.:
29115.93
Organism:
Bos taurus
Description:
Residue:
260
  
Inhibitor
Name:
BDBM50058822
Synonyms:
CHEMBL3325725
Type:
Small organic molecule
Emp. Form.:
C31H51NO5S
Mol. Mass.:
549.805
SMILES:
[H][C@@]12CC(C)(C)CC[C@@]1(CC[C@]1(C)C2=CC[C@]2([H])[C@@]3(C)CC[C@H](OS(N)(=O)=O)C(C)(C)[C@]3([H])CC[C@@]12C)C(=O)OC
: