Target
Carbonic anhydrase 2
Ligand
BDBM50059071
Substrate
Meas. Tech.
ChEMBL_1456925 (CHEMBL3368142)
Ki
450±n/a nM
Citation
 Pala, NMicheletto, LSechi, MAggarwal, MCarta, FMcKenna, RSupuran, CT Carbonic Anhydrase Inhibition with Benzenesulfonamides and Tetrafluorobenzenesulfonamides Obtained via Click Chemistry. ACS Med Chem Lett 5:927-30 (2014)  
Target
Name:
Carbonic anhydrase 2
Synonyms:
CA-II CAC Carbonate dehydratase II Carbonic anhydrase 2 (CA-II) Carbonic anhydrase C Carbonic anhydrase II (CA-II) Carbonic anhydrase II (hCA II) | Carbonic anhydrase isoenzyme II (hCA II)
Type:
Enzyme
Mol. Mass.:
29250.71
Organism:
Homo sapiens (Human)
Description:
P00918
Residue:
260
  
Inhibitor
Name:
BDBM50059071
Synonyms:
CHEMBL3326416
Type:
Small organic molecule
Emp. Form.:
C10H6F4N4O4S
Mol. Mass.:
354.238
SMILES:
COC(=O)c1cn(nn1)-c1c(F)c(F)c(c(F)c1F)S(N)(=O)=O
: