Target
Delta-type opioid receptor
Ligand
BDBM50061370
Substrate
Meas. Tech.
ChEMBL_1461562 (CHEMBL3396803)
EC50
72±n/a nM
Citation
 Sasmal, PKKrishna, CVAdabala, SSRoshaiah, MRawoof, KAThadi, ESukumar, KPCheera, SAbbineni, CRao, KVPrasanthi, ANijhawan, KJaleel, MIyer, LRChaitanya, TKTiwari, NKKrishna, NLPotluri, VKhanna, IFrimurer, TMLückmann, MRist, ØElster, LHögberg, T Optimisation of in silico derived 2-aminobenzimidazole hits as unprecedented selective kappa opioid receptor agonists. Bioorg Med Chem Lett 25:887-92 (2015)  
Target
Name:
Delta-type opioid receptor
Synonyms:
D-OR-1 Delta opioid receptor OPIATE Delta OPRD1 OPRK1 | opioid receptor, delta 1
Type:
G Protein-Coupled Receptor (GPCR)
Mol. Mass.:
40382.98
Organism:
Homo sapiens (Human)
Description:
Competition binding assays were carried out using membrane preparations from transfected HN9.10 cells that constitutively expressed the delta opioid receptor.
Residue:
372
  
Inhibitor
Name:
BDBM50061370
Synonyms:
CHEMBL3394004
Type:
Small organic molecule
Emp. Form.:
C19H23N5O3S
Mol. Mass.:
401.483
SMILES:
CS(=O)(=O)c1c[nH]c(c1)C(=O)Nc1nc2ccccc2n1CCN1CCCC1
: