Target
Delta-type opioid receptor
Ligand
BDBM54780
Substrate
Meas. Tech.
ChEMBL_1461562 (CHEMBL3396803)
EC50
2000±n/a nM
Citation
 Sasmal, PKKrishna, CVAdabala, SSRoshaiah, MRawoof, KAThadi, ESukumar, KPCheera, SAbbineni, CRao, KVPrasanthi, ANijhawan, KJaleel, MIyer, LRChaitanya, TKTiwari, NKKrishna, NLPotluri, VKhanna, IFrimurer, TMLückmann, MRist, ØElster, LHögberg, T Optimisation of in silico derived 2-aminobenzimidazole hits as unprecedented selective kappa opioid receptor agonists. Bioorg Med Chem Lett 25:887-92 (2015)  
Target
Name:
Delta-type opioid receptor
Synonyms:
D-OR-1 Delta opioid receptor OPIATE Delta OPRD1 OPRK1 | opioid receptor, delta 1
Type:
G Protein-Coupled Receptor (GPCR)
Mol. Mass.:
40382.98
Organism:
Homo sapiens (Human)
Description:
Competition binding assays were carried out using membrane preparations from transfected HN9.10 cells that constitutively expressed the delta opioid receptor.
Residue:
372
  
Inhibitor
Name:
BDBM54780
Synonyms:
4-chloranyl-N-[1-(2-pyrrolidin-1-ylethyl)benzimidazol-2-yl]benzamide 4-chloro-N-[1-(2-pyrrolidinoethyl)benzimidazol-2-yl]benzamide MLS000109558 cid_1121183
Type:
Small organic molecule
Emp. Form.:
C20H21ClN4O
Mol. Mass.:
368.86
SMILES:
Clc1ccc(cc1)C(=O)Nc1nc2ccccc2n1CCN1CCCC1
: