Target
Kappa-type opioid receptor
Ligand
BDBM50061381
Substrate
Meas. Tech.
ChEMBL_1461561 (CHEMBL3396802)
EC50
37±n/a nM
Citation
 Sasmal, PKKrishna, CVAdabala, SSRoshaiah, MRawoof, KAThadi, ESukumar, KPCheera, SAbbineni, CRao, KVPrasanthi, ANijhawan, KJaleel, MIyer, LRChaitanya, TKTiwari, NKKrishna, NLPotluri, VKhanna, IFrimurer, TMLückmann, MRist, ØElster, LHögberg, T Optimisation of in silico derived 2-aminobenzimidazole hits as unprecedented selective kappa opioid receptor agonists. Bioorg Med Chem Lett 25:887-92 (2015)  
Target
Name:
Kappa-type opioid receptor
Synonyms:
K-OR-1 Kappa-opioid receptor (KOR) Kappa-type opioid receptor (KOR) OPIATE Kappa OPRK1 kappa opioid receptor (KOR)
Type:
G Protein-Coupled Receptor (GPCR)
Mol. Mass.:
42648.76
Organism:
Homo sapiens (Human)
Description:
P41145
Residue:
380
  
Inhibitor
Name:
BDBM50061381
Synonyms:
CHEMBL3394007
Type:
Small organic molecule
Emp. Form.:
C19H20ClN5O
Mol. Mass.:
369.848
SMILES:
Clc1ccc(cc1)C(=O)Nc1nc2cccnc2n1CCN1CCCC1
: