Target
Kappa-type opioid receptor
Ligand
BDBM50061382
Substrate
Meas. Tech.
ChEMBL_1461561 (CHEMBL3396802)
EC50
10.0±n/a nM
Citation
 Sasmal, PKKrishna, CVAdabala, SSRoshaiah, MRawoof, KAThadi, ESukumar, KPCheera, SAbbineni, CRao, KVPrasanthi, ANijhawan, KJaleel, MIyer, LRChaitanya, TKTiwari, NKKrishna, NLPotluri, VKhanna, IFrimurer, TMLückmann, MRist, ØElster, LHögberg, T Optimisation of in silico derived 2-aminobenzimidazole hits as unprecedented selective kappa opioid receptor agonists. Bioorg Med Chem Lett 25:887-92 (2015)  
Target
Name:
Kappa-type opioid receptor
Synonyms:
K-OR-1 Kappa-opioid receptor (KOR) Kappa-type opioid receptor (KOR) OPIATE Kappa OPRK1 kappa opioid receptor (KOR)
Type:
G Protein-Coupled Receptor (GPCR)
Mol. Mass.:
42648.76
Organism:
Homo sapiens (Human)
Description:
P41145
Residue:
380
  
Inhibitor
Name:
BDBM50061382
Synonyms:
CHEMBL3394006
Type:
Small organic molecule
Emp. Form.:
C20H21ClN4O2
Mol. Mass.:
384.859
SMILES:
O[C@H]1CCN(CCn2c(NC(=O)c3ccc(Cl)cc3)nc3ccccc23)C1
: