Target
Mu-type opioid receptor
Ligand
BDBM54780
Substrate
Meas. Tech.
ChEMBL_1461563 (CHEMBL3396804)
EC50
6100±n/a nM
Citation
 Sasmal, PKKrishna, CVAdabala, SSRoshaiah, MRawoof, KAThadi, ESukumar, KPCheera, SAbbineni, CRao, KVPrasanthi, ANijhawan, KJaleel, MIyer, LRChaitanya, TKTiwari, NKKrishna, NLPotluri, VKhanna, IFrimurer, TMLückmann, MRist, ØElster, LHögberg, T Optimisation of in silico derived 2-aminobenzimidazole hits as unprecedented selective kappa opioid receptor agonists. Bioorg Med Chem Lett 25:887-92 (2015)  
Target
Name:
Mu-type opioid receptor
Synonyms:
M-OR-1 MOR-1 MUOR1 Mu opiate receptor OPRM1 hMOP | mu-type opioid receptor isoform MOR-1
Type:
G Protein-Coupled Receptor (GPCR)
Mol. Mass.:
44789.51
Organism:
Homo sapiens (Human)
Description:
P35372
Residue:
400
  
Inhibitor
Name:
BDBM54780
Synonyms:
4-chloranyl-N-[1-(2-pyrrolidin-1-ylethyl)benzimidazol-2-yl]benzamide 4-chloro-N-[1-(2-pyrrolidinoethyl)benzimidazol-2-yl]benzamide MLS000109558 cid_1121183
Type:
Small organic molecule
Emp. Form.:
C20H21ClN4O
Mol. Mass.:
368.86
SMILES:
Clc1ccc(cc1)C(=O)Nc1nc2ccccc2n1CCN1CCCC1
: