Target
Polyunsaturated fatty acid 5-lipoxygenase
Ligand
BDBM50062728
Substrate
Meas. Tech.
ChEMBL_1462969 (CHEMBL3398679)
IC50
900±n/a nM
Citation
 Flesch, DNess, JLamers, CDehm, FPopella, SSteri, ROgorek, IHieke, MDannhardt, GWerz, OWeggen, SSchubert-Zsilavecz, M SAR-studies of¿-secretase modulators with PPAR¿-agonistic and 5-lipoxygenase-inhibitory activity for Alzheimer's disease. Bioorg Med Chem Lett 25:841-6 (2015)  
Target
Name:
Polyunsaturated fatty acid 5-lipoxygenase
Synonyms:
5-LO 5-Lipoxygenase (5-LO) 5-Lipoygenase ALOX5 LOG5 | LOX5_HUMAN
Type:
Enzyme
Mol. Mass.:
77972.74
Organism:
Homo sapiens (Human)
Description:
Recombinant protein was purified from E. coli lysate. After ammonium sulfate precipitation and subsequent steps, the supernatant (S100) was used for 5-LO activity assay.
Residue:
674
  
Inhibitor
Name:
BDBM50062728
Synonyms:
CHEMBL3397720
Type:
Small organic molecule
Emp. Form.:
C32H27F6NO4S
Mol. Mass.:
635.616
SMILES:
CCCC\C(=C/c1cc(OCc2csc(n2)-c2ccc(cc2)C(F)(F)F)ccc1OCc1ccc(cc1)C(F)(F)F)C(O)=O
: