Target
Prostaglandin G/H synthase 1
Ligand
BDBM50062718
Substrate
Meas. Tech.
ChEMBL_1462978 (CHEMBL3398722)
IC50
>10000±n/a nM
Citation
 Flesch, DNess, JLamers, CDehm, FPopella, SSteri, ROgorek, IHieke, MDannhardt, GWerz, OWeggen, SSchubert-Zsilavecz, M SAR-studies of¿-secretase modulators with PPAR¿-agonistic and 5-lipoxygenase-inhibitory activity for Alzheimer's disease. Bioorg Med Chem Lett 25:841-6 (2015)  
Target
Name:
Prostaglandin G/H synthase 1
Synonyms:
COX1 Cyclooxygenase-1 (COX-1) PTGS1 | Prostaglandin G/H synthase (cyclooxygenase)
Type:
Protein
Mol. Mass.:
68868.60
Organism:
Ovis aries (Sheep)
Description:
Residue:
600
  
Inhibitor
Name:
BDBM50062718
Synonyms:
CHEMBL3397711
Type:
Small organic molecule
Emp. Form.:
C30H29F3O4
Mol. Mass.:
510.5441
SMILES:
CCCC\C(=C/c1cc(OC\C=C\c2ccccc2)ccc1OCc1ccc(cc1)C(F)(F)F)C(O)=O
: