Target
Sodium- and chloride-dependent GABA transporter 1
Ligand
BDBM50063498
Substrate
Meas. Tech.
ChEMBL_1463273 (CHEMBL3399462)
Ki
66±n/a nM
Citation
 Steffan, TRenukappa-Gutke, THöfner, GWanner, KT Design, synthesis and SAR studies of GABA uptake inhibitors derived from 2-substituted pyrrolidine-2-yl-acetic acids. Bioorg Med Chem 23:1284-306 (2015)  
Target
Name:
Sodium- and chloride-dependent GABA transporter 1
Synonyms:
GABA transporter 1 GABT1 GAT1 SLC6A1 Solute carrier family 6 member 1
Type:
PROTEIN
Mol. Mass.:
67079.40
Organism:
Homo sapiens (Human)
Description:
ChEMBL_1454196
Residue:
599
  
Inhibitor
Name:
BDBM50063498
Synonyms:
CHEMBL3398501
Type:
Small organic molecule
Emp. Form.:
C20H25NO3S2
Mol. Mass.:
391.547
SMILES:
[H][C@@]1([#6]-[#6]-[#6]-[#7]1-[#6]-[#6]\[#6]=[#6](/c1sccc1-[#6])-c1sccc1-[#6])[#6@H](-[#8])-[#6](-[#8])=O
: