Target
Histone-lysine N-methyltransferase EHMT2
Ligand
BDBM50009672
Substrate
Meas. Tech.
ChEMBL_1463673 (CHEMBL3399060)
IC50
2000±n/a nM
Citation
 Kung, PPHuang, BZehnder, LTatlock, JBingham, PKrivacic, CGajiwala, KDiehl, WYu, XMaegley, KA SAH derived potent and selective EZH2 inhibitors. Bioorg Med Chem Lett 25:1532-7 (2015)  
Target
Name:
Histone-lysine N-methyltransferase EHMT2
Synonyms:
BAT8 EHMT2 G9A Histone-lysine N-methyltransferase EHMT1/EHMT2 KMT1C Protein G9a (G9a)
Type:
Enzyme
Mol. Mass.:
132339.87
Organism:
Homo sapiens (Human)
Description:
Q96KQ7
Residue:
1210
  
Inhibitor
Name:
BDBM50009672
Synonyms:
AdoHcy S-(5'-adenosyl)-L-homocysteine S-[1-(adenin-9-yl)-1,5-dideoxy-beta-D-ribofuranos-5-yl]-L-homocysteine SAH US9175331, 1 | US9333217, S-Adenosyl-L-homocysteine (SAH)
Type:
Small organic molecule
Emp. Form.:
C14H20N6O5S
Mol. Mass.:
384.411
SMILES:
N[C@@H](CCSC[C@H]1O[C@H]([C@H](O)[C@@H]1O)n1cnc2c(N)ncnc12)C(O)=O
: