Target
Oxysterols receptor LXR-beta
Ligand
BDBM19992
Substrate
Meas. Tech.
ChEMBL_1464818 (CHEMBL3404173)
EC50
420±n/a nM
Citation
 Matsuda, TOkuda, AWatanabe, YMiura, TOzawa, HTosaka, AYamazaki, KYamaguchi, YKurobuchi, SKoura, MShibuya, K Design and discovery of 2-oxochromene derivatives as liver X receptorß-selective agonists. Bioorg Med Chem Lett 25:1274-8 (2015)  
Target
Name:
Oxysterols receptor LXR-beta
Synonyms:
LXRB Liver X, LXR beta NR1H2 Nuclear receptor NER Ubiquitously-expressed nuclear receptor
Type:
Enzyme Catalytic Domain
Mol. Mass.:
50978.79
Organism:
Homo sapiens (Human)
Description:
P55055
Residue:
460
  
Inhibitor
Name:
BDBM19992
Synonyms:
2-[3-[3-[[2-chloro-3-(trifluoromethyl)phenyl]methyl-[2,2-di(phenyl)ethyl]amino]propoxy]phenyl]acetic acid CHEMBL59030 GW3965 US10669296, Compound GW3965 | US10945978, Compound 2
Type:
Small organic molecule
Emp. Form.:
C33H31ClF3NO3
Mol. Mass.:
582.052
SMILES:
OC(=O)Cc1cccc(OCCCN(CC(c2ccccc2)c2ccccc2)Cc2cccc(c2Cl)C(F)(F)F)c1
: