Target
5-hydroxytryptamine receptor 2A
Ligand
BDBM86032
Substrate
Meas. Tech.
ChEMBL_1465386 (CHEMBL3406942)
Ki
100±n/a nM
Citation
 Sakhuja, RKondabolu, KCórdova-Sintjago, TTravers, SVincek, ASKim, MSAbboud, KAFang, LSun, ZCanal, CEBooth, RG Novel 4-substituted-N,N-dimethyltetrahydronaphthalen-2-amines: synthesis, affinity, and in silico docking studies at serotonin 5-HT2-type and histamine H1 G protein-coupled receptors. Bioorg Med Chem 23:1588-600 (2015)  
Target
Name:
5-hydroxytryptamine receptor 2A
Synonyms:
5-HT-2 5-HT2A 5-hydroxytryptamine receptor 2A (5HT-2A) 5HT2A_HUMAN HTR2A | Serotonin receptor 2A
Type:
undefined
Mol. Mass.:
52607.65
Organism:
Homo sapiens (Human)
Description:
P28223
Residue:
471
  
Inhibitor
Name:
BDBM86032
Synonyms:
trans-H2-PAT(-) | trans-PAT
Type:
Small organic molecule
Emp. Form.:
C18H21N
Mol. Mass.:
251.366
SMILES:
CN(C)[C@H]1C[C@H](c2ccccc2)c2ccccc2C1
: