Target
5-hydroxytryptamine receptor 2C
Ligand
BDBM86032
Substrate
Meas. Tech.
ChEMBL_1465388 (CHEMBL3406944)
Ki
30±n/a nM
Citation
 Sakhuja, RKondabolu, KCórdova-Sintjago, TTravers, SVincek, ASKim, MSAbboud, KAFang, LSun, ZCanal, CEBooth, RG Novel 4-substituted-N,N-dimethyltetrahydronaphthalen-2-amines: synthesis, affinity, and in silico docking studies at serotonin 5-HT2-type and histamine H1 G protein-coupled receptors. Bioorg Med Chem 23:1588-600 (2015)  
Target
Name:
5-hydroxytryptamine receptor 2C
Synonyms:
5-HT-1C 5-HT1C 5-HT2C-INI 5-HTR2C 5-hydroxytryptamine receptor 2C (5-HT-2C) 5HT-1C HTR1C Serotonin (5-HT3) receptor Serotonin Receptor 2C
Type:
G Protein-Coupled Receptor (GPCR)
Mol. Mass.:
51836.79
Organism:
Homo sapiens (Human)
Description:
P28335
Residue:
458
  
Inhibitor
Name:
BDBM86032
Synonyms:
trans-H2-PAT(-) | trans-PAT
Type:
Small organic molecule
Emp. Form.:
C18H21N
Mol. Mass.:
251.366
SMILES:
CN(C)[C@H]1C[C@H](c2ccccc2)c2ccccc2C1
: