Target
DNA gyrase subunit B
Ligand
BDBM50066094
Substrate
Meas. Tech.
ChEMBL_1465095 (CHEMBL3405427)
Temperature
298.15±n/a K
IC50
32480±n/a nM
Comments
extracted
Citation
 Saxena, SSamala, GRenuka, JSridevi, JPYogeeswari, PSriram, D Development of 2-amino-5-phenylthiophene-3-carboxamide derivatives as novel inhibitors of Mycobacterium tuberculosis DNA GyrB domain. Bioorg Med Chem 23:1402-12 (2015)  
Target
Name:
DNA gyrase subunit B
Synonyms:
GYRB_MYCSM | gyrB
Type:
PROTEIN
Mol. Mass.:
74505.25
Organism:
Mycobacterium smegmatis
Description:
ChEMBL_107961
Residue:
675
  
Inhibitor
Name:
BDBM50066094
Synonyms:
CHEMBL3402940
Type:
Small organic molecule
Emp. Form.:
C18H14N4O3S2
Mol. Mass.:
398.459
SMILES:
NC(=O)c1cc(sc1NC(=S)Nc1ccc(cc1)[N+]([O-])=O)-c1ccccc1
: