Target
Carbonic anhydrase 1
Ligand
BDBM50066130
Substrate
Meas. Tech.
ChEMBL_1465099 (CHEMBL3405431)
Ki
762±n/a nM
Citation
 Carta, FDi Cesare Mannelli, LPinard, MGhelardini, CScozzafava, AMcKenna, RSupuran, CT A class of sulfonamide carbonic anhydrase inhibitors with neuropathic pain modulating effects. Bioorg Med Chem 23:1828-40 (2015)  
Target
Name:
Carbonic anhydrase 1
Synonyms:
CA-I CAB Carbonate dehydratase I Carbonic anhydrase 1 (CA I) Carbonic anhydrase 1 (Recombinant CA I) Carbonic anhydrase B Carbonic anhydrase I (CA I) Carbonic anhydrase I (CAI) Carbonic anhydrase isoenzyme I (hCA I) | hCA
Type:
Enzyme
Mol. Mass.:
28873.37
Organism:
Homo sapiens (Human)
Description:
P00915
Residue:
261
  
Inhibitor
Name:
BDBM50066130
Synonyms:
CHEMBL3402962
Type:
Small organic molecule
Emp. Form.:
C13H13NO3S
Mol. Mass.:
263.312
SMILES:
NS(=O)(=O)c1ccc(OCc2ccccc2)cc1
: