Target
Carbonic anhydrase 9
Ligand
BDBM50066130
Substrate
Meas. Tech.
ChEMBL_1465102 (CHEMBL3405434)
Ki
18±n/a nM
Citation
 Carta, FDi Cesare Mannelli, LPinard, MGhelardini, CScozzafava, AMcKenna, RSupuran, CT A class of sulfonamide carbonic anhydrase inhibitors with neuropathic pain modulating effects. Bioorg Med Chem 23:1828-40 (2015)  
Target
Name:
Carbonic anhydrase 9
Synonyms:
CA-IX CAH9_HUMAN Carbonic anhydrase 9 (CA IX) Carbonic anhydrase 9 precursor Carbonic anhydrase IX (CAIX) Carbonic anhydrases; II & IX MN RCC-associated antigen G250
Type:
Enzyme
Mol. Mass.:
49669.03
Organism:
Homo sapiens (Human)
Description:
Catalytic domain of human cloned isozyme was used in the assay
Residue:
459
  
Inhibitor
Name:
BDBM50066130
Synonyms:
CHEMBL3402962
Type:
Small organic molecule
Emp. Form.:
C13H13NO3S
Mol. Mass.:
263.312
SMILES:
NS(=O)(=O)c1ccc(OCc2ccccc2)cc1
: