Target
Cysteinyl leukotriene receptor 1
Ligand
BDBM50066950
Substrate
Meas. Tech.
ChEMBL_1466140 (CHEMBL3404758)
IC50
250±n/a nM
Citation
 Itadani, STakahashi, SIma, MSekiguchi, TAratani, YEgashira, HMatsumura, NInoue, AYonetomi, YFujita, MNakayama, YTakeuchi, J Discovery of a potent, orally available dual CysLT1 and CysLT2 antagonist with dicarboxylic acid. Bioorg Med Chem 23:2079-97 (2015)  
Target
Name:
Cysteinyl leukotriene receptor 1
Synonyms:
CLTR1_HUMAN CYSLTR1 Cysteinyl leukotriene receptor HG55 LTD4 receptor | Leukotriene Cysteinyl 1
Type:
Enzyme Catalytic Domain
Mol. Mass.:
38565.16
Organism:
Homo sapiens (Human)
Description:
Leukotriene Cysteinyl 1 CYSLTR1 HUMAN::Q9Y271
Residue:
337
  
Inhibitor
Name:
BDBM50066950
Synonyms:
CHEMBL3403188
Type:
Small organic molecule
Emp. Form.:
C32H31NO7
Mol. Mass.:
541.591
SMILES:
OC(=O)CCCn1cc(C(O)=O)c(=O)c2c(\C=C\c3ccc(OCCCCOc4ccccc4)cc3)cccc12
: