Target
Phosphatidylinositol 4,5-bisphosphate 3-kinase catalytic subunit delta isoform
Ligand
BDBM50067535
Substrate
Meas. Tech.
ChEMBL_1465820 (CHEMBL3406125)
Ki
>4000±n/a nM
Citation
 Boyd, MJBandarage, UKBennett, HByrn, RRDavies, IGu, WJacobs, MLedeboer, MWLedford, BLeeman, JRPerola, EWang, TBennani, YClark, MPCharifson, PS Isosteric replacements of the carboxylic acid of drug candidate VX-787: Effect of charge on antiviral potency and kinase activity of azaindole-based influenza PB2 inhibitors. Bioorg Med Chem Lett 25:1990-4 (2015)  
Target
Name:
Phosphatidylinositol 4,5-bisphosphate 3-kinase catalytic subunit delta isoform
Synonyms:
PI3-kinase p110 subunit delta PI3-kinase subunit p110-delta PIK3CD Phosphatidylinositol 4,5-biphosphate 3-kinase catalytic subunit delta (PIK3CD) Phosphatidylinositol 4,5-bisphosphate 3-kinase 110 kDa catalytic subunit delta (PI3K delta) Phosphatidylinositol 4,5-bisphosphate 3-kinase catalytic subunit delta (PI3Kdelta) Phosphatidylinositol 4,5-bisphosphate 3-kinase catalytic subunit delta isoform (PI3K delta) Phosphatidylinositol 4,5-bisphosphate 3-kinase catalytic subunit delta isoform (PI3K-delta) Phosphatidylinositol 4,5-bisphosphate 3-kinase catalytic subunit delta isoform (PI3Kdelta)
Type:
Enzyme Subunit
Mol. Mass.:
119489.41
Organism:
Homo sapiens (Human)
Description:
O00329
Residue:
1044
  
Inhibitor
Name:
BDBM50067535
Synonyms:
CHEMBL3401986
Type:
Small organic molecule
Emp. Form.:
C21H22F2N6O
Mol. Mass.:
412.4358
SMILES:
CNC(=O)[C@H]1C2CCC(CC2)[C@@H]1Nc1nc(ncc1F)-c1c[nH]c2ncc(F)cc12
: