Target
Amine oxidase [flavin-containing] A
Ligand
BDBM50113851
Substrate
Meas. Tech.
ChEMBL_1465839 (CHEMBL3406144)
IC50
7870±n/a nM
Citation
 Kakizawa, TOta, YItoh, YTsumoto, HSuzuki, T Histone H3 peptide based LSD1-selective inhibitors. Bioorg Med Chem Lett 25:1925-8 (2015)  
Target
Name:
Amine oxidase [flavin-containing] A
Synonyms:
AOFA_HUMAN MAO-A Monoamine oxidase Monoamine oxidase type A (MAO A) Monoamine oxidase type A (MAOA)
Type:
Protein
Mol. Mass.:
59689.53
Organism:
Homo sapiens (Human)
Description:
P21397
Residue:
527
  
Inhibitor
Name:
BDBM50113851
Synonyms:
(+/-)-Tranylcypromine 2-Phenyl-cyclopropylamine CHEMBL313833 Tranylcypromine,(+) US8609708, 6 Tranyl- cypromine | US8609708, 6 Tranylcypromine
Type:
Small organic molecule
Emp. Form.:
C9H11N
Mol. Mass.:
133.1903
SMILES:
NC1CC1c1ccccc1
: