Target
Beta-secretase 1
Ligand
BDBM50400218
Substrate
Meas. Tech.
ChEMBL_1466423 (CHEMBL3406368)
IC50
78±n/a nM
Citation
 Liu, JChen, WXu, YRen, SZhang, WLi, Y Design, synthesis and biological evaluation of tasiamide B derivatives as BACE1 inhibitors. Bioorg Med Chem 23:1963-74 (2015)  
Target
Name:
Beta-secretase 1
Synonyms:
ASP2 Aspartyl protease 2 BACE1 Beta-secretase (BACE) Beta-secretase 1 (BACE 1) Beta-secretase 1 (BACE1) Beta-site amyloid precursor protein cleaving enzyme 1 Memapsin-2 beta-Secretase (BACE-1) | beta-Secretase (BACE1)
Type:
Protein
Mol. Mass.:
55755.10
Organism:
Homo sapiens (Human)
Description:
P56817
Residue:
501
  
Inhibitor
Name:
BDBM50400218
Synonyms:
CHEMBL2181018
Type:
Small organic molecule
Emp. Form.:
C44H65N7O11
Mol. Mass.:
868.0272
SMILES:
CC(C)C[C@H](NC(=O)C[C@H](O)[C@H](Cc1ccccc1)NC(=O)[C@H](CCC(N)=O)N(C)C(=O)[C@@H](NC(=O)[C@H](C)O)C(C)C)C(=O)N[C@@H](C)C(=O)N(C)[C@H](Cc1ccccc1)C(O)=O
: