Target
Carbonic anhydrase 12
Ligand
BDBM50067983
Substrate
Meas. Tech.
ChEMBL_1466434 (CHEMBL3406379)
Ki
66±n/a nM
Citation
 Bozdag, MCarta, FVullo, DAkdemir, AIsik, SLanzi, CScozzafava, AMasini, ESupuran, CT Synthesis of a new series of dithiocarbamates with effective human carbonic anhydrase inhibitory activity and antiglaucoma action. Bioorg Med Chem 23:2368-76 (2015)  
Target
Name:
Carbonic anhydrase 12
Synonyms:
CA-XII CAH12_HUMAN Carbonic anhydrase Carbonic anhydrase XII Carbonic anhydrase XII (CAXII) | Tumor antigen HOM-RCC-3.1.3
Type:
Enzyme
Mol. Mass.:
39456.00
Organism:
Homo sapiens (Human)
Description:
Catalytic domain of human cloned isozyme was used in the assay
Residue:
354
  
Inhibitor
Name:
BDBM50067983
Synonyms:
CHEMBL3400807
Type:
Small organic molecule
Emp. Form.:
C7H9NNa2O2S2
Mol. Mass.:
249.261
SMILES:
[Na+].[Na+].[O-]C(=O)[C@@H]1CCCN(C1)C([S-])=S
: