Target
Carbonic anhydrase 9
Ligand
BDBM50067988
Substrate
Meas. Tech.
ChEMBL_1466433 (CHEMBL3406378)
Ki
55±n/a nM
Citation
 Bozdag, MCarta, FVullo, DAkdemir, AIsik, SLanzi, CScozzafava, AMasini, ESupuran, CT Synthesis of a new series of dithiocarbamates with effective human carbonic anhydrase inhibitory activity and antiglaucoma action. Bioorg Med Chem 23:2368-76 (2015)  
Target
Name:
Carbonic anhydrase 9
Synonyms:
CA-IX CAH9_HUMAN Carbonic anhydrase 9 (CA IX) Carbonic anhydrase 9 precursor Carbonic anhydrase IX (CAIX) Carbonic anhydrases; II & IX MN RCC-associated antigen G250
Type:
Enzyme
Mol. Mass.:
49669.03
Organism:
Homo sapiens (Human)
Description:
Catalytic domain of human cloned isozyme was used in the assay
Residue:
459
  
Inhibitor
Name:
BDBM50067988
Synonyms:
CHEMBL3400812
Type:
Small organic molecule
Emp. Form.:
C6H10NNaOS2
Mol. Mass.:
199.269
SMILES:
[Na+].CC1COCCN1C([S-])=S
: