Target
Carbonic anhydrase 2
Ligand
BDBM50067993
Substrate
Meas. Tech.
ChEMBL_1466432 (CHEMBL3406377)
Ki
36±n/a nM
Citation
 Bozdag, MCarta, FVullo, DAkdemir, AIsik, SLanzi, CScozzafava, AMasini, ESupuran, CT Synthesis of a new series of dithiocarbamates with effective human carbonic anhydrase inhibitory activity and antiglaucoma action. Bioorg Med Chem 23:2368-76 (2015)  
Target
Name:
Carbonic anhydrase 2
Synonyms:
CA-II CAC Carbonate dehydratase II Carbonic anhydrase 2 (CA-II) Carbonic anhydrase C Carbonic anhydrase II (CA-II) Carbonic anhydrase II (hCA II) | Carbonic anhydrase isoenzyme II (hCA II)
Type:
Enzyme
Mol. Mass.:
29250.71
Organism:
Homo sapiens (Human)
Description:
P00918
Residue:
260
  
Inhibitor
Name:
BDBM50067993
Synonyms:
CHEMBL3400797
Type:
Small organic molecule
Emp. Form.:
C5H11KN2S2
Mol. Mass.:
202.383
SMILES:
[K+].CN(C)CCNC([S-])=S
: