Target
Tyrosine-protein kinase BTK
Ligand
BDBM50068595
Substrate
Meas. Tech.
ChEMBL_1466555 (CHEMBL3407012)
IC50
4.8±n/a nM
Citation
 Asami, TKawahata, WSawa, M TR-FRET binding assay targeting unactivated form of Bruton's tyrosine kinase. Bioorg Med Chem Lett 25:2033-6 (2015)  
Target
Name:
Tyrosine-protein kinase BTK
Synonyms:
AGMX1 Agammaglobulinaemia tyrosine kinase B cell progenitor kinase BPK BTK_HUMAN Tyrosine Kinase BTK Tyrosine-protein kinase BTK (BTK)
Type:
Enzyme
Mol. Mass.:
76289.95
Organism:
Homo sapiens (Human)
Description:
Q06187
Residue:
659
  
Inhibitor
Name:
BDBM50068595
Synonyms:
CHEMBL3402356
Type:
Small organic molecule
Emp. Form.:
C56H51N7O9S
Mol. Mass.:
998.111
SMILES:
Cc1c(NC(=O)c2ccc(cc2)C(C)(C)C)cccc1-c1cn(C)c(=O)c(Nc2ccc(cc2)C(=O)N2CCOC(CNC(=S)Nc3ccc(c(c3)C(O)=O)-c3c4ccc(O)cc4oc4cc(=O)ccc34)C2)n1
: