Target
Neurotensin receptor type 1
Ligand
BDBM50069092
Substrate
Meas. Tech.
ChEMBL_1466612 (CHEMBL3407205)
Ki
>25000±n/a nM
Citation
 Thomas, JBGiddings, AMOlepu, SWiethe, RWWarner, KRSarret, PLongpre, JMRunyon, SPGilmour, BP The amide linker in nonpeptide neurotensin receptor ligands plays a key role in calcium signaling at the neurotensin receptor type 2. Bioorg Med Chem Lett 25:2060-4 (2015)  
Target
Name:
Neurotensin receptor type 1
Synonyms:
NTR1_RAT Ntsr | Ntsr1
Type:
PROTEIN
Mol. Mass.:
47070.64
Organism:
Rattus norvegicus
Description:
ChEMBL_1466612
Residue:
424
  
Inhibitor
Name:
BDBM50069092
Synonyms:
CHEMBL3403508
Type:
Small organic molecule
Emp. Form.:
C24H24FN3O4
Mol. Mass.:
437.4635
SMILES:
COc1ccccc1-c1cc(NC(=O)C2(CCCCC2)C(O)=O)nn1-c1ccc(F)cc1
: