Target
Neurotensin receptor type 2
Ligand
BDBM50069091
Substrate
Meas. Tech.
ChEMBL_1466615 (CHEMBL3404057)
EC50
55±n/a nM
Citation
 Thomas, JBGiddings, AMOlepu, SWiethe, RWWarner, KRSarret, PLongpre, JMRunyon, SPGilmour, BP The amide linker in nonpeptide neurotensin receptor ligands plays a key role in calcium signaling at the neurotensin receptor type 2. Bioorg Med Chem Lett 25:2060-4 (2015)  
Target
Name:
Neurotensin receptor type 2
Synonyms:
High-affinity levocabastine-sensitive neurotensin receptor NTR2_RAT Neurotensin receptor type 2 Ntsr2
Type:
PROTEIN
Mol. Mass.:
46280.50
Organism:
Rattus norvegicus
Description:
ChEMBL_1466615
Residue:
416
  
Inhibitor
Name:
BDBM50069091
Synonyms:
CHEMBL3403507
Type:
Small organic molecule
Emp. Form.:
C25H26FN3O5
Mol. Mass.:
467.4894
SMILES:
COc1cccc(OC)c1-c1cc(NC(=O)C2(CCCCC2)C(O)=O)nn1-c1ccc(F)cc1
: