Target
Serine protease hepsin
Ligand
BDBM50069104
Substrate
Meas. Tech.
ChEMBL_1466700 (CHEMBL3404298)
IC50
350±n/a nM
Citation
 Franco, FMJones, DEHarris, PKHan, ZWildman, SAJarvis, CMJanetka, JW Structure-based discovery of small molecule hepsin and HGFA protease inhibitors: Evaluation of potency and selectivity derived from distinct binding pockets. Bioorg Med Chem 23:2328-43 (2015)  
Target
Name:
Serine protease hepsin
Synonyms:
HEPS_HUMAN Hepsin TMPRSS1 Transmembrane protease, serine 1
Type:
Enzyme
Mol. Mass.:
45016.98
Organism:
Homo sapiens (Human)
Description:
Human deglycosylated hepsin was expressed in Pichia pastoris.
Residue:
417
  
Inhibitor
Name:
BDBM50069104
Synonyms:
CHEMBL1449583 | US9182402, 4
Type:
Small organic molecule
Emp. Form.:
C18H16N2
Mol. Mass.:
260.333
SMILES:
Cc1cccc(c1)C1Nc2cccc3cccc(N1)c23
: