Target
Carbonic anhydrase
Ligand
BDBM11638
Substrate
Meas. Tech.
ChEMBL_1466707 (CHEMBL3404500)
Ki
30±n/a nM
Citation
 Syrjänen, LKuuslahti, MTolvanen, MVullo, DParkkila, SSupuran, CT Theß-carbonic anhydrase from the malaria mosquito Anopheles gambiae is highly inhibited by sulfonamides. Bioorg Med Chem 23:2303-9 (2015)  
Target
Name:
Carbonic anhydrase
Synonyms:
Carbonate dehydratase | Carbonic anhydrase
Type:
PROTEIN
Mol. Mass.:
29919.95
Organism:
Anopheles gambiae
Description:
ChEMBL_109570
Residue:
255
  
Inhibitor
Name:
BDBM11638
Synonyms:
CHEMBL26 N-[(1-ethylpyrrolidin-2-yl)methyl]-2-methoxy-5-sulfamoylbenzamide SULPIRIDE,(-) Sulpiride, SLP US10172837, Sulpiride
Type:
Small organic molecule
Emp. Form.:
C15H23N3O4S
Mol. Mass.:
341.426
SMILES:
CCN1CCCC1CNC(=O)c1cc(ccc1OC)S(N)(=O)=O
: