Target
Carbonic anhydrase 1
Ligand
BDBM10870
Substrate
Meas. Tech.
ChEMBL_1466705 (CHEMBL3404498)
Ki
6.0±n/a nM
Citation
 Syrjänen, LKuuslahti, MTolvanen, MVullo, DParkkila, SSupuran, CT Theß-carbonic anhydrase from the malaria mosquito Anopheles gambiae is highly inhibited by sulfonamides. Bioorg Med Chem 23:2303-9 (2015)  
Target
Name:
Carbonic anhydrase 1
Synonyms:
CA-I CAB Carbonate dehydratase I Carbonic anhydrase 1 (CA I) Carbonic anhydrase 1 (Recombinant CA I) Carbonic anhydrase B Carbonic anhydrase I (CA I) Carbonic anhydrase I (CAI) Carbonic anhydrase isoenzyme I (hCA I) | hCA
Type:
Enzyme
Mol. Mass.:
28873.37
Organism:
Homo sapiens (Human)
Description:
P00915
Residue:
261
  
Inhibitor
Name:
BDBM10870
Synonyms:
2-N-(4-aminobenzene)-1,3,4-thiadiazole-2,5-disulfonamide CHEMBL268439 aminobenzolamide deriv. 43 | aromatic/heteroaromatic sulfonamide 15
Type:
Small organic molecule
Emp. Form.:
C8H9N5O4S3
Mol. Mass.:
335.383
SMILES:
Nc1ccc(cc1)S(=O)(=O)Nc1nnc(s1)S(N)(=O)=O
: