Target
Macrophage migration inhibitory factor
Ligand
BDBM50073665
Substrate
Meas. Tech.
ChEMBL_1467649 (CHEMBL3411011)
IC50
11000±n/a nM
Citation
 Spencer, ESDale, EJGommans, ALRutledge, MTVo, CTNakatani, YGamble, ABSmith, RAWilbanks, SMHampton, MBTyndall, JD Multiple binding modes of isothiocyanates that inhibit macrophage migration inhibitory factor. Eur J Med Chem 93:501-10 (2015)  
Target
Name:
Macrophage migration inhibitory factor
Synonyms:
GIF Glycosylation-inhibiting factor L-dopachrome tautomerase MIF/CD74 (Macrophage migration inhibitory factor and HLA-DR antigens-associated invariant chain) MMIF Macrophage migration inhibitory factor (MIF) | Phenylpyruvate tautomerase
Type:
Enzyme
Mol. Mass.:
12478.18
Organism:
Homo sapiens (Human)
Description:
P14174
Residue:
115
  
Inhibitor
Name:
BDBM50073665
Synonyms:
CHEBI:85103 Isothiocyanatobenzene Phenyl Isothiocyanate
Type:
Small organic molecule
Emp. Form.:
C7H5NS
Mol. Mass.:
135.186
SMILES:
S=C=Nc1ccccc1
: