Target
Histone-lysine N-methyltransferase EZH2
Ligand
BDBM50400783
Substrate
Meas. Tech.
ChEMBL_1473136 (CHEMBL3417984)
Ki
700±n/a nM
Citation
 Kaniskan, HÜKonze, KDJin, J Selective inhibitors of protein methyltransferases. J Med Chem 58:1596-629 (2015)  
Target
Name:
Histone-lysine N-methyltransferase EZH2
Synonyms:
ENX-1 EZH2_HUMAN Histone-lysine N-methyltransferase EZH2 Lysine N-methyltransferase 6
Type:
Protein
Mol. Mass.:
85367.84
Organism:
Homo sapiens (Human)
Description:
Q15910
Residue:
746
  
Inhibitor
Name:
BDBM50400783
Synonyms:
CHEMBL1608462
Type:
Small organic molecule
Emp. Form.:
C21H25N5O2
Mol. Mass.:
379.4555
SMILES:
CC(C)n1ncc2c(cc(nc12)C1CC1)C(=O)NCc1c(C)cc(C)[nH]c1=O
: