Target
N-lysine methyltransferase KMT5A
Ligand
BDBM50051116
Substrate
Meas. Tech.
ChEMBL_1473625 (CHEMBL3420964)
Ki
2000±n/a nM
Citation
 Kaniskan, HÜKonze, KDJin, J Selective inhibitors of protein methyltransferases. J Med Chem 58:1596-629 (2015)  
Target
Name:
N-lysine methyltransferase KMT5A
Synonyms:
KMT5A N-lysine methyltransferase SETD8 SET domain-containing protein 8 (SetD8) SET8 | SETD8
Type:
Enzyme
Mol. Mass.:
42919.11
Organism:
Homo sapiens (Human)
Description:
Q9NQR1
Residue:
393
  
Inhibitor
Name:
BDBM50051116
Synonyms:
CHEMBL3318284
Type:
Small organic molecule
Emp. Form.:
C30H50O7
Mol. Mass.:
522.7138
SMILES:
[H][C@]12[C@@H](C)[C@H](O)C[C@@H](O)[C@@]1(C)C=C(C)[C@H]([C@@H]2\C=C(/C)C(O)=O)C(C)=CC[C@H](O)C[C@@H](O)[C@H](C)[C@@H](O)C(C)C
: