Target
Protein arginine N-methyltransferase 1 [11-371]
Ligand
BDBM50075101
Substrate
Meas. Tech.
ChEMBL_1473623 (CHEMBL3420962)
IC50
9500±n/a nM
Citation
 Kaniskan, HÜKonze, KDJin, J Selective inhibitors of protein methyltransferases. J Med Chem 58:1596-629 (2015)  
Target
Name:
Protein arginine N-methyltransferase 1 [11-371]
Synonyms:
ANM1_HUMAN HRMT1L2 PRMT1 Protein arginine methyltransferase 1 (PRMT1) | Protein-arginine N-methyltransferase 1
Type:
Protein
Mol. Mass.:
41506.52
Organism:
Homo sapiens (Human)
Description:
Q99873[11-371]
Residue:
361
  
Inhibitor
Name:
BDBM50075101
Synonyms:
CHEMBL3414624
Type:
Small organic molecule
Emp. Form.:
C18H29N7O5
Mol. Mass.:
423.4668
SMILES:
CCCN[C@@H](CC[C@H](N)C(O)=O)C[C@H]1O[C@H]([C@H](O)[C@@H]1O)n1cnc2c(N)ncnc12
: