Target
Tyrosine-protein kinase SYK
Ligand
BDBM50075821
Substrate
Meas. Tech.
ChEMBL_1473534 (CHEMBL3420413)
IC50
1.000000±n/a nM
Citation
 Ellis, JMAltman, MDBass, AButcher, JWByford, AJDonofrio, AGalloway, SHaidle, AMJewell, JKelly, NLeccese, EKLee, SMaddess, MMiller, JRMoy, LYOsimboni, EOtte, RDReddy, MVSpencer, KSun, BVincent, SHWard, GJWoo, GHYang, CHoushyar, HNorthrup, AB Overcoming mutagenicity and ion channel activity: optimization of selective spleen tyrosine kinase inhibitors. J Med Chem 58:1929-39 (2015)  
Target
Name:
Tyrosine-protein kinase SYK
Synonyms:
KSYK_HUMAN Spleen Tyrosine Kinase Tyrosine-protein kinase SYK (Syk)
Type:
Enzyme
Mol. Mass.:
72079.99
Organism:
Homo sapiens (Human)
Description:
P43405
Residue:
635
  
Inhibitor
Name:
BDBM50075821
Synonyms:
CHEMBL3415605
Type:
Small organic molecule
Emp. Form.:
C22H28N8O3S
Mol. Mass.:
484.575
SMILES:
Cc1cc(Nc2cc(N[C@@H]3CS(=O)(=O)CC[C@@H]3N)cnc2C(N)=O)nc(C)c1-c1cnn(C)c1
: