Target
Tyrosine-protein kinase SYK
Ligand
BDBM50075731
Substrate
Meas. Tech.
ChEMBL_1473534 (CHEMBL3420413)
IC50
7.0±n/a nM
Citation
 Ellis, JMAltman, MDBass, AButcher, JWByford, AJDonofrio, AGalloway, SHaidle, AMJewell, JKelly, NLeccese, EKLee, SMaddess, MMiller, JRMoy, LYOsimboni, EOtte, RDReddy, MVSpencer, KSun, BVincent, SHWard, GJWoo, GHYang, CHoushyar, HNorthrup, AB Overcoming mutagenicity and ion channel activity: optimization of selective spleen tyrosine kinase inhibitors. J Med Chem 58:1929-39 (2015)  
Target
Name:
Tyrosine-protein kinase SYK
Synonyms:
KSYK_HUMAN Spleen Tyrosine Kinase Tyrosine-protein kinase SYK (Syk)
Type:
Enzyme
Mol. Mass.:
72079.99
Organism:
Homo sapiens (Human)
Description:
P43405
Residue:
635
  
Inhibitor
Name:
BDBM50075731
Synonyms:
CHEMBL3415608
Type:
Small organic molecule
Emp. Form.:
C19H22N6O
Mol. Mass.:
350.4176
SMILES:
N[C@H]1CCCC[C@H]1Nc1cnc(C(N)=O)c(c1)-c1nc2ccccc2[nH]1
: