Target
Sphingosine kinase 2
Ligand
BDBM50077143
Substrate
Meas. Tech.
ChEMBL_1474027 (CHEMBL3419998)
Ki
1200±n/a nM
Citation
 Patwardhan, NNMorris, EAKharel, YRaje, MRGao, MTomsig, JLLynch, KRSantos, WL Structure-activity relationship studies and in vivo activity of guanidine-based sphingosine kinase inhibitors: discovery of SphK1- and SphK2-selective inhibitors. J Med Chem 58:1879-99 (2015)  
Target
Name:
Sphingosine kinase 2
Synonyms:
SK 2 SPHK2 SPK 2 Sphingosine kinase types 2 (SphK2)
Type:
Protein
Mol. Mass.:
69221.44
Organism:
Homo sapiens (Human)
Description:
Q9NRA0
Residue:
654
  
Inhibitor
Name:
BDBM50077143
Synonyms:
CHEMBL3416833
Type:
Small organic molecule
Emp. Form.:
C20H30ClN5O
Mol. Mass.:
391.938
SMILES:
Cl.CCCCCCCCc1ccc(cc1)-c1noc(n1)[C@@H]1CCN1C(N)=N
: