Target
Histone deacetylase 6
Ligand
BDBM50078758
Substrate
Meas. Tech.
ChEMBL_1471540 (CHEMBL3420275)
EC50
2000±n/a nM
Citation
 Lin, XChen, WQiu, ZGuo, LZhu, WLi, WWang, ZZhang, WZhang, ZRong, YZhang, MYu, LZhong, SZhao, RWu, XWong, JCTang, G Design and synthesis of orally bioavailable aminopyrrolidinone histone deacetylase 6 inhibitors. J Med Chem 58:2809-20 (2015)  
Target
Name:
Histone deacetylase 6
Synonyms:
Cereblon/Histone deacetylase 6 HDAC6 Histone deacetylase 6 (HDAC6) KIAA0901 | ORF Names:JM21
Type:
Chromatin regulator; hydrolase; repressor
Mol. Mass.:
131381.51
Organism:
Homo sapiens (Human)
Description:
Q9UBN7
Residue:
1215
  
Inhibitor
Name:
BDBM50078758
Synonyms:
CHEMBL3415455
Type:
Small organic molecule
Emp. Form.:
C21H26N4O4
Mol. Mass.:
398.4555
SMILES:
CN(C)CCOc1cccc(c1)N1CCC(Nc2ccc(cc2)C(=O)NO)C1=O
: