Target
MAP kinase-interacting serine/threonine-protein kinase 2
Ligand
BDBM50079405
Substrate
Meas. Tech.
ChEMBL_1470961 (CHEMBL3419829)
Ki
340±n/a nM
Citation
 Yu, MLi, PBasnet, SKKumarasiri, MDiab, STeo, TAlbrecht, HWang, S Discovery of 4-(dihydropyridinon-3-yl)amino-5-methylthieno[2,3-d]pyrimidine derivatives as potent Mnk inhibitors: synthesis, structure-activity relationship analysis and biological evaluation. Eur J Med Chem 95:116-26 (2015)  
Target
Name:
MAP kinase-interacting serine/threonine-protein kinase 2
Synonyms:
GPRK7 MAP kinase-interacting serine/threonine-protein kinase 2 (MKNK2) MAP-kinase interacting kinase 2 (MNK2) MKNK2_HUMAN | MNK2
Type:
Protein
Mol. Mass.:
51870.79
Organism:
Homo sapiens (Human)
Description:
Q9HBH9
Residue:
465
  
Inhibitor
Name:
BDBM50079405
Synonyms:
CHEMBL3417205
Type:
Small organic molecule
Emp. Form.:
C17H19N5O3S
Mol. Mass.:
373.429
SMILES:
COCCn1cc(C)cc(Nc2ncnc3sc(C(N)=O)c(C)c23)c1=O
: