Target
Insulin-like growth factor 1 receptor
Ligand
BDBM50081173
Substrate
Meas. Tech.
ChEMBL_1475747 (CHEMBL3424980)
IC50
3300±n/a nM
Citation
 Kettle, JGBallard, PBardelle, CCockerill, MColclough, NCritchlow, SEDebreczeni, JFairley, GFillery, SGraham, MAGoodwin, LGuichard, SHudson, KWard, RAWhittaker, D Discovery and optimization of a novel series of Dyrk1B kinase inhibitors to explore a MEK resistance hypothesis. J Med Chem 58:2834-44 (2015)  
Target
Name:
Insulin-like growth factor 1 receptor
Synonyms:
CD_antigen=CD221 IGF1R Insulin-like growth factor 1 receptor (IGF1R) Insulin-like growth factor 1 receptor alpha chain Insulin-like growth factor I receptor | Insulin-like growth factor receptor (IGFR)
Type:
Protein
Mol. Mass.:
154776.79
Organism:
Homo sapiens (Human)
Description:
P08069
Residue:
1367
  
Inhibitor
Name:
BDBM50081173
Synonyms:
CHEMBL3421972
Type:
Small organic molecule
Emp. Form.:
C24H26N6O2
Mol. Mass.:
430.5022
SMILES:
COc1cc(OC2CCN(C)CC2)ccc1Nc1nccc(n1)-c1c[nH]c2cnccc12
: