Target
Beta-secretase 1
Ligand
BDBM136570
Substrate
Meas. Tech.
ChEMBL_1474435 (CHEMBL3423724)
IC50
6.0±n/a nM
Citation
 Brodney, MABeck, EMButler, CRBarreiro, GJohnson, EFRiddell, DParris, KNolan, CEFan, YAtchison, KGonzales, CRobshaw, AEDoran, SDBundesmann, MWBuzon, LDutra, JHenegar, KLaChapelle, EHou, XRogers, BNPandit, JLira, RMartinez-Alsina, LMikochik, PMurray, JCOgilvie, KPrice, LSakya, SMYu, AZhang, YO'Neill, BT Utilizing structures of CYP2D6 and BACE1 complexes to reduce risk of drug-drug interactions with a novel series of centrally efficacious BACE1 inhibitors. J Med Chem 58:3223-52 (2015)  
Target
Name:
Beta-secretase 1
Synonyms:
ASP2 Aspartyl protease 2 BACE1 Beta-secretase (BACE) Beta-secretase 1 (BACE 1) Beta-secretase 1 (BACE1) Beta-site amyloid precursor protein cleaving enzyme 1 Memapsin-2 beta-Secretase (BACE-1) | beta-Secretase (BACE1)
Type:
Protein
Mol. Mass.:
55755.10
Organism:
Homo sapiens (Human)
Description:
P56817
Residue:
501
  
Inhibitor
Name:
BDBM136570
Synonyms:
US8865706, 9
Type:
Small organic molecule
Emp. Form.:
C18H19F2N3O2S
Mol. Mass.:
379.424
SMILES:
C[C@H]1SC(N)=N[C@]2(CO[C@H](C[C@@H]12)c1cc(C)no1)c1ccc(F)cc1F
: