Target
Orexin/Hypocretin receptor type 1
Ligand
BDBM50084384
Substrate
Meas. Tech.
ChEMBL_1477382 (CHEMBL3429484)
Ki
64±n/a nM
Citation
 Kuduk, SDSkudlarek, JWDiMarco, CNBruno, JGPausch, MHO'Brien, JACabalu, TDStevens, JBrunner, JTannenbaum, PLGarson, SLSavitz, ATHarrell, CMGotter, ALWinrow, CJRenger, JJColeman, PJ Identification of MK-8133: An orexin-2 selective receptor antagonist with favorable development properties. Bioorg Med Chem Lett 25:2488-92 (2015)  
Target
Name:
Orexin/Hypocretin receptor type 1
Synonyms:
HCRTR1 OX1R_HUMAN Orexin receptor type 1 (OR 1) Orexin receptor type 1 (OX1) Orexin receptor type 1 (OxR1) | Ox1r
Type:
Protein
Mol. Mass.:
47554.50
Organism:
Homo sapiens (Human)
Description:
O43613
Residue:
425
  
Inhibitor
Name:
BDBM50084384
Synonyms:
CHEMBL3426135
Type:
Small organic molecule
Emp. Form.:
C21H20F3N5O2
Mol. Mass.:
431.411
SMILES:
C[C@@H]1CC[C@H](CN1C(=O)c1ccccc1-n1nccn1)Oc1cc(ccn1)C(F)(F)F
: