Target
Orexin receptor type 2
Ligand
BDBM50084385
Substrate
Meas. Tech.
ChEMBL_1477381 (CHEMBL3429483)
Ki
0.600000±n/a nM
Citation
 Kuduk, SDSkudlarek, JWDiMarco, CNBruno, JGPausch, MHO'Brien, JACabalu, TDStevens, JBrunner, JTannenbaum, PLGarson, SLSavitz, ATHarrell, CMGotter, ALWinrow, CJRenger, JJColeman, PJ Identification of MK-8133: An orexin-2 selective receptor antagonist with favorable development properties. Bioorg Med Chem Lett 25:2488-92 (2015)  
Target
Name:
Orexin receptor type 2
Synonyms:
HCRTR2 OX2R_HUMAN Orexin receptor type 2 (OR-2) Orexin receptor type 2 (OX2R) Ox-2-R | Ox2-R
Type:
Protein
Mol. Mass.:
50710.53
Organism:
Homo sapiens (Human)
Description:
O43614
Residue:
444
  
Inhibitor
Name:
BDBM50084385
Synonyms:
CHEMBL3426134
Type:
Small organic molecule
Emp. Form.:
C22H25N5O2
Mol. Mass.:
391.4662
SMILES:
CCc1ccnc(O[C@@H]2CC[C@@H](C)N(C2)C(=O)c2ccccc2-n2nccn2)c1
: