Target
Orexin receptor type 2
Ligand
BDBM50084389
Substrate
Meas. Tech.
ChEMBL_1477383 (CHEMBL3429485)
IC50
9.0±n/a nM
Citation
 Kuduk, SDSkudlarek, JWDiMarco, CNBruno, JGPausch, MHO'Brien, JACabalu, TDStevens, JBrunner, JTannenbaum, PLGarson, SLSavitz, ATHarrell, CMGotter, ALWinrow, CJRenger, JJColeman, PJ Identification of MK-8133: An orexin-2 selective receptor antagonist with favorable development properties. Bioorg Med Chem Lett 25:2488-92 (2015)  
Target
Name:
Orexin receptor type 2
Synonyms:
HCRTR2 OX2R_HUMAN Orexin receptor type 2 (OR-2) Orexin receptor type 2 (OX2R) Ox-2-R | Ox2-R
Type:
Protein
Mol. Mass.:
50710.53
Organism:
Homo sapiens (Human)
Description:
O43614
Residue:
444
  
Inhibitor
Name:
BDBM50084389
Synonyms:
CHEMBL3426130
Type:
Small organic molecule
Emp. Form.:
C21H23N5O2
Mol. Mass.:
377.4396
SMILES:
C[C@@H]1CC[C@H](CN1C(=O)c1ccccc1-n1nccn1)Oc1ccc(C)cn1
: