Target
Orexin/Hypocretin receptor type 1
Ligand
BDBM50084395
Substrate
Meas. Tech.
ChEMBL_1477382 (CHEMBL3429484)
Ki
140±n/a nM
Citation
 Kuduk, SDSkudlarek, JWDiMarco, CNBruno, JGPausch, MHO'Brien, JACabalu, TDStevens, JBrunner, JTannenbaum, PLGarson, SLSavitz, ATHarrell, CMGotter, ALWinrow, CJRenger, JJColeman, PJ Identification of MK-8133: An orexin-2 selective receptor antagonist with favorable development properties. Bioorg Med Chem Lett 25:2488-92 (2015)  
Target
Name:
Orexin/Hypocretin receptor type 1
Synonyms:
HCRTR1 OX1R_HUMAN Orexin receptor type 1 (OR 1) Orexin receptor type 1 (OX1) Orexin receptor type 1 (OxR1) | Ox1r
Type:
Protein
Mol. Mass.:
47554.50
Organism:
Homo sapiens (Human)
Description:
O43613
Residue:
425
  
Inhibitor
Name:
BDBM50084395
Synonyms:
CHEMBL3426144 | US9745284, 2
Type:
Small organic molecule
Emp. Form.:
C21H23N5O3
Mol. Mass.:
393.439
SMILES:
COc1ccnc(O[C@@H]2CC[C@@H](C)N(C2)C(=O)c2ccccc2-n2nccn2)c1
: